Reaction Details
TargetMu-type opioid receptor
LigandBDBM50070386
Substrate/Competitorn/a
Meas. Tech.ChEMBL_1467479 (CHEMBL3411102)
IC50 0.800000±n/a nM
Citation Guillemyn, KKleczkowska, PLesniak, ADyniewicz, JVan der Poorten, OVan den Eynde, IKeresztes, AVarga, ELai, JPorreca, FChung, NNLemieux, CMika, JRojewska, EMakuch, WVan Duppen, JPrzewlocka, BVanden Broeck, JLipkowski, AWSchiller, PWTourwé, DBallet, S Synthesis and biological evaluation of compact, conformationally constrained bifunctional opioid agonist - neurokinin-1 antagonist peptidomimetics. Eur J Med Chem92:64-77 (2015) 
 
Mu-type opioid receptor
Name:Mu-type opioid receptor
Type:Enzyme Catalytic Domain
Mol. Mass.:11165.58
Organism:GUINEA PIG
Description:P97266
Residue:98
BDBM50070386
NameBDBM50070386
Synonyms:CHEMBL3408737
TypeSmall organic molecule
Emp. Form.C30H42N8O5
Mol. Mass.594.7051
SMILES[H][C@@]1(Cc2ccccc2CN(CCC(N)=O)C1=O)NC(=O)[C@@H](CCCNC(N)=N)NC(=O)[C@@H](N)Cc1c(C)cc(O)cc1C