Reaction Details
TargetCarbonic anhydrase 2
LigandBDBM50070606
Substrate/Competitorn/a
Meas. Tech.ChEMBL_1468133 (CHEMBL3414019)
Ki 0.200000±n/a nM
Citation Haider, SAlam, MSHamid, H 1,3,4-Thiadiazoles: a potent multi targeted pharmacological scaffold. Eur J Med Chem92:156-77 (2015) 
 
Carbonic anhydrase 2
Name:Carbonic anhydrase 2
Type:Enzyme
Mol. Mass.:29250.71
Organism:Homo sapiens (Human)
Description:P00918
Residue:260
BDBM50070606
NameBDBM50070606
Synonyms:CHEMBL3408993
TypeSmall organic molecule
Emp. Form.C13H12ClN5O8S3
Mol. Mass.497.911
SMILES[O-][Cl](=O)(=O)=O.NS(=O)(=O)c1nnc(NS(=O)(=O)c2ccc(cc2)-[n+]2ccccc2)s1