Reaction Details
Target5-hydroxytryptamine receptor 7
LigandBDBM21367
Substrate/Competitorn/a
Meas. Tech.ChEMBL_1468169 (CHEMBL3414154)
Ki 0.220000±n/a nM
Citation Canale, VKurczab, RPartyka, ASatala, GWitek, JJastrzebska-Wiesek, MPawlowski, MBojarski, AJWesolowska, AZajdel, P Towards novel 5-HT7versus 5-HT1A receptor ligands among LCAPs with cyclic amino acid amide fragments: design, synthesis, and antidepressant properties. Part II. Eur J Med Chem92:202-11 (2015) 
 
5-hydroxytryptamine receptor 7
Name:5-hydroxytryptamine receptor 7
Type:G Protein-Coupled Receptor (GPCR)
Mol. Mass.:53573.08
Organism:Homo sapiens (Human)
Description:P34969
Residue:479
BDBM21367
NameBDBM21367
Synonyms:6-{4-[2-(methylsulfanyl)phenyl]piperazin-1-yl}-N-(1,2,3,4-tetrahydronaphthalen-1-yl)hexanamide LP-44 | Piperazinehexanamide derivative, 5
TypeSmall organic molecule
Emp. Form.C27H37N3OS
Mol. Mass.451.667
SMILESCSc1ccccc1N1CCN(CCCCCC(=O)NC2CCCc3ccccc23)CC1