Reaction Details
Target5-hydroxytryptamine receptor 1A
LigandBDBM50070798
Substrate/Competitorn/a
Meas. Tech.ChEMBL_1468610 (CHEMBL3413556)
Ki 6.7±n/a nM
Citation Kolaczkowski, MMarcinkowska, MBucki, ASniecikowska, JPawlowski, MKazek, GSiwek, AJastrzebska-Wiesek, MPartyka, AWasik, AWesolowska, AMierzejewski, PBienkowski, P Novel 5-HT6 receptor antagonists/D2 receptor partial agonists targeting behavioral and psychological symptoms of dementia. Eur J Med Chem92:221-35 (2015) 
 
5-hydroxytryptamine receptor 1A
Name:5-hydroxytryptamine receptor 1A
Type:n/a
Mol. Mass.:46122.49
Organism:Homo sapiens (Human)
Description:n/a
Residue:422
BDBM50070798
NameBDBM50070798
Synonyms:CHEMBL3409256
TypeSmall organic molecule
Emp. Form.C28H30N4O4S
Mol. Mass.518.627
SMILESNC(=O)c1ccccc1OCCCN1CCN(CC1)c1cccc2n(ccc12)S(=O)(=O)c1ccccc1