Reaction Details
Target5-hydroxytryptamine receptor 2A
LigandBDBM21395
Substrate/Competitorn/a
Meas. Tech.ChEMBL_1468609 (CHEMBL3413555)
Ki 0.300000±n/a nM
Citation Kolaczkowski, MMarcinkowska, MBucki, ASniecikowska, JPawlowski, MKazek, GSiwek, AJastrzebska-Wiesek, MPartyka, AWasik, AWesolowska, AMierzejewski, PBienkowski, P Novel 5-HT6 receptor antagonists/D2 receptor partial agonists targeting behavioral and psychological symptoms of dementia. Eur J Med Chem92:221-35 (2015) 
 
5-hydroxytryptamine receptor 2A
Name:5-hydroxytryptamine receptor 2A
Type:undefined
Mol. Mass.:52607.65
Organism:Homo sapiens (Human)
Description:P28223
Residue:471
BDBM21395
NameBDBM21395
Synonyms:3-(2-(4-(4-Fluorobenzoyl)piperidinol)ethyl)-2,4(1H,3H)-quinazolinedione CHEMBL1628637 Ketanserin R-41-468 [3H]-Ketanserin
Typeradiolabeled ligand
Emp. Form.C22H22FN3O3
Mol. Mass.395.4268
SMILESFc1ccc(cc1)C(=O)C1CCN(CCn2c(=O)[nH]c3ccccc3c2=O)CC1