Reaction Details
TargetD(2) dopamine receptor
LigandBDBM50070896
Substrate/Competitorn/a
Meas. Tech.ChEMBL_1468595 (CHEMBL3413541)
Ki 4.8±n/a nM
Citation Kolaczkowski, MMarcinkowska, MBucki, ASniecikowska, JPawlowski, MKazek, GSiwek, AJastrzebska-Wiesek, MPartyka, AWasik, AWesolowska, AMierzejewski, PBienkowski, P Novel 5-HT6 receptor antagonists/D2 receptor partial agonists targeting behavioral and psychological symptoms of dementia. Eur J Med Chem92:221-35 (2015) 
 
D(2) dopamine receptor
Name:D(2) dopamine receptor
Type:Cell-surface receptors
Mol. Mass.:50647.10
Organism:Homo sapiens (Human)
Description:P14416
Residue:443
BDBM50070896
NameBDBM50070896
Synonyms:CHEMBL3409234
TypeSmall organic molecule
Emp. Form.C33H37N3O2
Mol. Mass.507.6658
SMILESO=C1CCc2ccc(OCCCCN3CCC(CC3)c3cn(Cc4ccccc4)c4ccccc34)cc2N1