Reaction Details
Target5-hydroxytryptamine receptor 6
LigandBDBM50070901
Substrate/Competitorn/a
Meas. Tech.ChEMBL_1468594 (CHEMBL3413540)
Ki 16±n/a nM
Citation Kolaczkowski, MMarcinkowska, MBucki, ASniecikowska, JPawlowski, MKazek, GSiwek, AJastrzebska-Wiesek, MPartyka, AWasik, AWesolowska, AMierzejewski, PBienkowski, P Novel 5-HT6 receptor antagonists/D2 receptor partial agonists targeting behavioral and psychological symptoms of dementia. Eur J Med Chem92:221-35 (2015) 
 
5-hydroxytryptamine receptor 6
Name:5-hydroxytryptamine receptor 6
Type:G Protein-Coupled Receptor (GPCR)
Mol. Mass.:46968.43
Organism:Homo sapiens (Human)
Description:P50406
Residue:440
BDBM50070901
NameBDBM50070901
Synonyms:CHEMBL3409261
TypeSmall organic molecule
Emp. Form.C28H31N3O3S
Mol. Mass.489.629
SMILESO=S(=O)(c1ccccc1)n1ccc2c(cccc12)N1CCN(CCCCOc2ccccc2)CC1