Reaction Details
Target5-hydroxytryptamine receptor 6
LigandBDBM50070820
Substrate/Competitorn/a
Meas. Tech.ChEMBL_1468594 (CHEMBL3413540)
Ki 7.3±n/a nM
Citation Kolaczkowski, MMarcinkowska, MBucki, ASniecikowska, JPawlowski, MKazek, GSiwek, AJastrzebska-Wiesek, MPartyka, AWasik, AWesolowska, AMierzejewski, PBienkowski, P Novel 5-HT6 receptor antagonists/D2 receptor partial agonists targeting behavioral and psychological symptoms of dementia. Eur J Med Chem92:221-35 (2015) 
 
5-hydroxytryptamine receptor 6
Name:5-hydroxytryptamine receptor 6
Type:G Protein-Coupled Receptor (GPCR)
Mol. Mass.:46968.43
Organism:Homo sapiens (Human)
Description:P50406
Residue:440
BDBM50070820
NameBDBM50070820
Synonyms:CHEMBL3409242
TypeSmall organic molecule
Emp. Form.C32H35ClN4O2
Mol. Mass.543.099
SMILESClc1cccc(Cn2ccc3c(cccc23)N2CCN(CCCCOc3ccc4CCC(=O)Nc4c3)CC2)c1