Reaction Details
TargetThermolysin
LigandBDBM50070930
Substrate/Competitorn/a
Meas. Tech.ChEMBL_1468794 (CHEMBL3411804)
Ki 43±n/a nM
Citation Nasief, NNHangauer, D Additivity or cooperativity: which model can predict the influence of simultaneous incorporation of two or more functionalities in a ligand molecule? Eur J Med Chem90:897-915 (2015) 
 
Thermolysin
Name:Thermolysin
Type:PROTEIN
Mol. Mass.:60097.54
Organism:Bacillus thermoproteolyticus
Description:ChEMBL_1468794
Residue:548
BDBM50070930
NameBDBM50070930
Synonyms:CHEMBL3409517
TypeSmall organic molecule
Emp. Form.C21H35LiN3O5P
Mol. Mass.447.434
SMILES[Li+].CC(C)C[C@H](NP([O-])(=O)CNC(=O)OCc1ccccc1)C(=O)NCCC(C)(C)C