Reaction Details
TargetThermolysin
LigandBDBM50070933
Substrate/Competitorn/a
Meas. Tech.ChEMBL_1468794 (CHEMBL3411804)
Ki 37±n/a nM
Citation Nasief, NNHangauer, D Additivity or cooperativity: which model can predict the influence of simultaneous incorporation of two or more functionalities in a ligand molecule? Eur J Med Chem90:897-915 (2015) 
 
Thermolysin
Name:Thermolysin
Type:PROTEIN
Mol. Mass.:60097.54
Organism:Bacillus thermoproteolyticus
Description:ChEMBL_1468794
Residue:548
BDBM50070933
NameBDBM50070933
Synonyms:CHEMBL3409514
TypeSmall organic molecule
Emp. Form.C19H31LiN3O5P
Mol. Mass.419.381
SMILES[Li+].CC(C)CNC(=O)[C@H](CC(C)C)NP([O-])(=O)CNC(=O)OCc1ccccc1