Reaction Details
TargetThermolysin
LigandBDBM50396786
Substrate/Competitorn/a
Meas. Tech.ChEMBL_1468794 (CHEMBL3411804)
Ki 291±n/a nM
Citation Nasief, NNHangauer, D Additivity or cooperativity: which model can predict the influence of simultaneous incorporation of two or more functionalities in a ligand molecule? Eur J Med Chem90:897-915 (2015) 
 
Thermolysin
Name:Thermolysin
Type:PROTEIN
Mol. Mass.:60097.54
Organism:Bacillus thermoproteolyticus
Description:ChEMBL_1468794
Residue:548
BDBM50396786
NameBDBM50396786
Synonyms:CHEMBL2172740
TypeSmall organic molecule
Emp. Form.C17H27N3O5P
Mol. Mass.384.3877
SMILESCCNC(=O)[C@H](CC(C)C)NP([O-])(=O)CNC(=O)OCc1ccccc1