Reaction Details
TargetProtein arginine N-methyltransferase 8
LigandBDBM50070951
Substrate/Competitorn/a
Meas. Tech.ChEMBL_1468800 (CHEMBL3411810)
IC50 28400±n/a nM
Citation Hu, HOwens, EASu, HYan, LLevitz, AZhao, XHenary, MZheng, YG Exploration of cyanine compounds as selective inhibitors of protein arginine methyltransferases: synthesis and biological evaluation. J Med Chem58:1228-43 (2015) 
 
Protein arginine N-methyltransferase 8
Name:Protein arginine N-methyltransferase 8
Type:Protein
Mol. Mass.:45293.70
Organism:Homo sapiens (Human)
Description:n/a
Residue:394
BDBM50070951
NameBDBM50070951
Synonyms:CHEMBL3409558
TypeSmall organic molecule
Emp. Form.C43H37IN2S2
Mol. Mass.772.802
SMILES[I-].C(CN1\C(Sc2c1ccc1ccccc21)=C\C=C\c1sc2c(ccc3ccccc23)[n+]1CCCc1ccccc1)Cc1ccccc1