Reaction Details
TargetProtein arginine N-methyltransferase 1 [11-371]
LigandBDBM50070956
Substrate/Competitorn/a
Meas. Tech.ChEMBL_1468798 (CHEMBL3411808)
IC50 3390±n/a nM
Citation Hu, HOwens, EASu, HYan, LLevitz, AZhao, XHenary, MZheng, YG Exploration of cyanine compounds as selective inhibitors of protein arginine methyltransferases: synthesis and biological evaluation. J Med Chem58:1228-43 (2015) 
 
Protein arginine N-methyltransferase 1 [11-371]
Name:Protein arginine N-methyltransferase 1 [11-371]
Type:Protein
Mol. Mass.:41506.52
Organism:Homo sapiens (Human)
Description:Q99873[11-371]
Residue:361
BDBM50070956
NameBDBM50070956
Synonyms:CHEMBL3409563
TypeSmall organic molecule
Emp. Form.C37H39IN2
Mol. Mass.638.6234
SMILES[I-].CCN1\C(=C\C=C\C=C\C2=[N+](CC)c3ccc4ccccc4c3C2(C)C)C(C)(C)c2c1ccc1ccccc21