Reaction Details
TargetProtein arginine N-methyltransferase 1 [11-371]
LigandBDBM50070958
Substrate/Competitorn/a
Meas. Tech.ChEMBL_1468798 (CHEMBL3411808)
IC50 4000±n/a nM
Citation Hu, HOwens, EASu, HYan, LLevitz, AZhao, XHenary, MZheng, YG Exploration of cyanine compounds as selective inhibitors of protein arginine methyltransferases: synthesis and biological evaluation. J Med Chem58:1228-43 (2015) 
 
Protein arginine N-methyltransferase 1 [11-371]
Name:Protein arginine N-methyltransferase 1 [11-371]
Type:Protein
Mol. Mass.:41506.52
Organism:Homo sapiens (Human)
Description:Q99873[11-371]
Residue:361
BDBM50070958
NameBDBM50070958
Synonyms:CHEMBL3409557
TypeSmall organic molecule
Emp. Form.C33H33IN2S2
Mol. Mass.648.663
SMILES[I-].CCCCN1\C(Sc2c1ccc1ccccc21)=C\C=C\c1sc2c(ccc3ccccc23)[n+]1CCCC