Reaction Details
TargetInsulin-like growth factor 1 receptor
LigandBDBM50315887
Substrate/Competitorn/a
Meas. Tech.ChEMBL_1468956 (CHEMBL3412613)
IC50 2.0±n/a nM
Citation Aware, VGaikwad, NChavan, SManohar, SBose, JKhanna, SB-Rao, CDixit, NSingh, KSDamre, ASharma, RPatil, SRoychowdhury, A Cyclopentyl-pyrimidine based analogues as novel and potent IGF-1R inhibitor. Eur J Med Chem92:246-56 (2015) 
 
Insulin-like growth factor 1 receptor
Name:Insulin-like growth factor 1 receptor
Type:Protein
Mol. Mass.:154776.79
Organism:Homo sapiens (Human)
Description:P08069
Residue:1367
BDBM50315887
NameBDBM50315887
Synonyms:(1s,3s)-3-(8-amino-1-(2-phenylquinolin-7-yl)imidazo[1,5-a]pyrazin-3-yl)-1-methylcyclobutanol OSI-906
TypeSmall organic molecule
Emp. Form.C26H23N5O
Mol. Mass.421.4937
SMILESC[C@@]1(O)C[C@@H](C1)c1nc(-c2ccc3ccc(nc3c2)-c2ccccc2)c2c(N)nccn12