Reaction Details
TargetKappa-type opioid receptor
LigandBDBM50071093
Substrate/Competitorn/a
Meas. Tech.ChEMBL_1468975 (CHEMBL3412632)
Ki 30±n/a nM
Citation Hu, MGiulianotti, MAMcLaughlin, JPShao, JDebevec, GMaida, LEGeer, PCazares, MMisler, JLi, LDooley, CGanno, MLEans, SOMizrachi, ESantos, RGYongye, ABHoughten, RAYu, Y Synthesis and biological evaluations of novel endomorphin analogues containinga-hydroxy-ß-phenylalanine (AHPBA) displaying mixedµ/d opioid receptor agonist andd opioid receptor antagonist activities. Eur J Med Chem92:270-81 (2015) 
 
Kappa-type opioid receptor
Name:Kappa-type opioid receptor
Type:G Protein-Coupled Receptor (GPCR)
Mol. Mass.:42744.99
Organism:Cavia porcellus (domestic guinea pig)
Description:P41144
Residue:380
BDBM50071093
NameBDBM50071093
Synonyms:CHEMBL3409764
TypeSmall organic molecule
Emp. Form.C40H45N5O5
Mol. Mass.675.8158
SMILESCc1cc(O)cc(C)c1C[C@H](N)C(=O)N1CCc2ccccc2C1C(=O)N[C@@H](Cc1ccccc1)C(=O)N[C@H](CC(N)=O)Cc1ccccc1