Reaction Details
TargetMu-type opioid receptor
LigandBDBM50071094
Substrate/Competitorn/a
Meas. Tech.ChEMBL_1468973 (CHEMBL3412630)
Ki 14±n/a nM
Citation Hu, MGiulianotti, MAMcLaughlin, JPShao, JDebevec, GMaida, LEGeer, PCazares, MMisler, JLi, LDooley, CGanno, MLEans, SOMizrachi, ESantos, RGYongye, ABHoughten, RAYu, Y Synthesis and biological evaluations of novel endomorphin analogues containinga-hydroxy-ß-phenylalanine (AHPBA) displaying mixedµ/d opioid receptor agonist andd opioid receptor antagonist activities. Eur J Med Chem92:270-81 (2015) 
 
Mu-type opioid receptor
Name:Mu-type opioid receptor
Type:G Protein-Coupled Receptor (GPCR)
Mol. Mass.:44503.11
Organism:Rattus norvegicus (rat)
Description:Competition binding assays were carried out using membrane preparations from transfected HN9.10 cells that constitutively expressed the mu opioid receptor.
Residue:398
BDBM50071094
NameBDBM50071094
Synonyms:CHEMBL3409765
TypeSmall organic molecule
Emp. Form.C42H46N6O5
Mol. Mass.714.8518
SMILESCc1cc(O)cc(C)c1C[C@H](N)C(=O)N1CCc2ccccc2C1C(=O)N[C@@H](Cc1c[nH]c2ccccc12)C(=O)N[C@H](CC(N)=O)Cc1ccccc1