Reaction Details
TargetBromodomain-containing protein 4
LigandBDBM50380682
Substrate/Competitorn/a
Meas. Tech.ChEMBL_1469310 (CHEMBL3414207)
IC50 100±n/a nM
Citation Zhao, LWang, YCao, DChen, TWang, QLi, YXu, YZhang, NWang, XChen, DChen, LChen, YLXia, GShi, ZLiu, YCLin, YMiao, ZShen, JXiong, B Fragment-based drug discovery of 2-thiazolidinones as BRD4 inhibitors: 2. Structure-based optimization. J Med Chem58:1281-97 (2015) 
 
Bromodomain-containing protein 4
Name:Bromodomain-containing protein 4
Type:Protein
Mol. Mass.:152264.84
Organism:Homo sapiens (Human)
Description:O60885
Residue:1362
BDBM50380682
NameBDBM50380682
Synonyms:CHEMBL2017291 | I-BET151 (16)
TypeSmall organic molecule
Emp. Form.C23H21N5O3
Mol. Mass.415.4445
SMILESCOc1cc2c3n([C@H](C)c4ccccn4)c(=O)[nH]c3cnc2cc1-c1c(C)noc1C