Reaction Details
TargetMetabotropic glutamate receptor 5
LigandBDBM50071324
Substrate/Competitorn/a
Meas. Tech.ChEMBL_1469541 (CHEMBL3412489)
Ki 69±n/a nM
Citation Jaeschke, GKolczewski, SSpooren, WVieira, EBitter-Stoll, NBoissin, PBorroni, EBüttelmann, BCeccarelli, SClemann, NDavid, BFunk, CGuba, WHarrison, AHartung, THoner, MHuwyler, JKuratli, MNiederhauser, UPähler, APeters, JUPetersen, APrinssen, ERicci, ARueher, DRueher, MSchneider, MSpurr, PStoll, TTännler, DWichmann, JPorter, RHWettstein, JGLindemann, L Metabotropic glutamate receptor 5 negative allosteric modulators: discovery of 2-chloro-4-[1-(4-fluorophenyl)-2,5-dimethyl-1H-imidazol-4-ylethynyl]pyridine (basimglurant, RO4917523), a promising novel medicine for psychiatric diseases. J Med Chem58:1358-71 (2015) 
 
Metabotropic glutamate receptor 5
Name:Metabotropic glutamate receptor 5
Type:Enzyme
Mol. Mass.:132484.72
Organism:Homo sapiens (Human)
Description:n/a
Residue:1212
BDBM50071324
NameBDBM50071324
Synonyms:CHEMBL3410207
TypeSmall organic molecule
Emp. Form.C18H12N2O
Mol. Mass.272.3007
SMILESC1Oc2ccccc2-n2cnc(C#Cc3ccccc3)c12