Reaction Details
TargetPotassium voltage-gated channel subfamily H member 2
LigandBDBM50071376
Substrate/Competitorn/a
Meas. Tech.ChEMBL_1469544 (CHEMBL3412492)
IC50>1000±n/a nM
Citation Jaeschke, GKolczewski, SSpooren, WVieira, EBitter-Stoll, NBoissin, PBorroni, EBüttelmann, BCeccarelli, SClemann, NDavid, BFunk, CGuba, WHarrison, AHartung, THoner, MHuwyler, JKuratli, MNiederhauser, UPähler, APeters, JUPetersen, APrinssen, ERicci, ARueher, DRueher, MSchneider, MSpurr, PStoll, TTännler, DWichmann, JPorter, RHWettstein, JGLindemann, L Metabotropic glutamate receptor 5 negative allosteric modulators: discovery of 2-chloro-4-[1-(4-fluorophenyl)-2,5-dimethyl-1H-imidazol-4-ylethynyl]pyridine (basimglurant, RO4917523), a promising novel medicine for psychiatric diseases. J Med Chem58:1358-71 (2015) 
 
Potassium voltage-gated channel subfamily H member 2
Name:Potassium voltage-gated channel subfamily H member 2
Type:Multi-pass membrane protein
Mol. Mass.:126672.65
Organism:Homo sapiens (Human)
Description:Q12809
Residue:1159
BDBM50071376
NameBDBM50071376
Synonyms:CHEMBL3410224
TypeSmall organic molecule
Emp. Form.C18H12ClF2N3
Mol. Mass.343.758
SMILESCc1nc(C#Cc2ccnc(Cl)c2)c(C)n1-c1ccc(F)cc1F