Reaction Details
TargetPantothenate kinase 1
LigandBDBM50071470
Substrate/Competitorn/a
Meas. Tech.ChEMBL_1469796 (CHEMBL3413790)
IC50 550±n/a nM
Citation Sharma, LKLeonardi, RLin, WBoyd, VAGoktug, AShelat, AAChen, TJackowski, SRock, CO A high-throughput screen reveals new small-molecule activators and inhibitors of pantothenate kinases. J Med Chem58:1563-8 (2015) 
 
Pantothenate kinase 1
Name:Pantothenate kinase 1
Type:PROTEIN
Mol. Mass.:64345.71
Organism:Homo sapiens (Human)
Description:ChEMBL_109585
Residue:598
BDBM50071470
NameBDBM50071470
Synonyms:CHEMBL3410257
TypeSmall organic molecule
Emp. Form.C20H18FN5O
Mol. Mass.363.3882
SMILESCc1nc2c3cccnc3nn2c(C)c1CCC(=O)Nc1ccccc1F