Reaction Details
TargetPantothenate kinase 1
LigandBDBM50071456
Substrate/Competitorn/a
Meas. Tech.ChEMBL_1469793 (CHEMBL3413787)
IC50 70±n/a nM
Citation Sharma, LKLeonardi, RLin, WBoyd, VAGoktug, AShelat, AAChen, TJackowski, SRock, CO A high-throughput screen reveals new small-molecule activators and inhibitors of pantothenate kinases. J Med Chem58:1563-8 (2015) 
 
Pantothenate kinase 1
Name:Pantothenate kinase 1
Type:PROTEIN
Mol. Mass.:64345.71
Organism:Homo sapiens (Human)
Description:ChEMBL_109585
Residue:598
BDBM50071456
NameBDBM50071456
Synonyms:CHEMBL3410246
TypeSmall organic molecule
Emp. Form.C21H21N5OS
Mol. Mass.391.489
SMILESCSc1cccc(NC(=O)CCc2c(C)nc3c4cccnc4nn3c2C)c1