Reaction Details
TargetPantothenate kinase 2, mitochondrial
LigandBDBM50071456
Substrate/Competitorn/a
Meas. Tech.ChEMBL_1469794 (CHEMBL3413788)
IC50 92±n/a nM
Citation Sharma, LKLeonardi, RLin, WBoyd, VAGoktug, AShelat, AAChen, TJackowski, SRock, CO A high-throughput screen reveals new small-molecule activators and inhibitors of pantothenate kinases. J Med Chem58:1563-8 (2015) 
 
Pantothenate kinase 2, mitochondrial
Name:Pantothenate kinase 2, mitochondrial
Type:PROTEIN
Mol. Mass.:62702.05
Organism:Homo sapiens (Human)
Description:ChEMBL_109586
Residue:570
BDBM50071456
NameBDBM50071456
Synonyms:CHEMBL3410246
TypeSmall organic molecule
Emp. Form.C21H21N5OS
Mol. Mass.391.489
SMILESCSc1cccc(NC(=O)CCc2c(C)nc3c4cccnc4nn3c2C)c1