Reaction Details
TargetBaculoviral IAP repeat-containing protein 2
LigandBDBM50071847
Substrate/Competitorn/a
Meas. Tech.ChEMBL_1467261 (CHEMBL3411458)
IC50 3.6±n/a nM
Citation Perez, HLChaudhry, CEmanuel, SLFanslau, CFargnoli, JGan, JKim, KSLei, MNaglich, JGTraeger, SCVuppugalla, RWei, DDVite, GDTalbott, RLBorzilleri, RM Discovery of potent heterodimeric antagonists of inhibitor of apoptosis proteins (IAPs) with sustained antitumor activity. J Med Chem58:1556-62 (2015) 
 
Baculoviral IAP repeat-containing protein 2
Name:Baculoviral IAP repeat-containing protein 2
Type:Protein
Mol. Mass.:69900.47
Organism:Homo sapiens (Human)
Description:Q13490
Residue:618
BDBM50071847
NameBDBM50071847
Synonyms:CHEMBL3410878
TypeSmall organic molecule
Emp. Form.C55H76N8O7
Mol. Mass.961.2413
SMILESCN[C@@H](C)C(=O)N[C@H](C(=O)N1C[C@H](C[C@H]1C(=O)N[C@@H]1CCCc2ccccc12)Oc1ccc2C[C@H](N(Cc2c1)C(=O)[C@@H](NC(=O)[C@H](C)NC)C(C)(C)C)C(=O)N[C@@H]1CCCc2ccccc12)C(C)(C)C