Reaction Details
TargeteIF-2-alpha kinase GCN2
LigandBDBM50072070
Substrate/Competitorn/a
Meas. Tech.ChEMBL_1467741 (CHEMBL3412167)
IC50 42±n/a nM
Citation Smith, ALAndrews, KLBeckmann, HBellon, SFBeltran, PJBooker, SChen, HChung, YAD'Angelo, NDDao, JDellamaggiore, KRJaeckel, PKendall, RLabitzke, KLong, AMMaterna-Reichelt, SMitchell, PNorman, MHPowers, DRose, MShaffer, PLWu, MMLipford, JR Discovery of 1H-pyrazol-3(2H)-ones as potent and selective inhibitors of protein kinase R-like endoplasmic reticulum kinase (PERK). J Med Chem58:1426-41 (2015) 
 
eIF-2-alpha kinase GCN2
Name:eIF-2-alpha kinase GCN2
Type:PROTEIN
Mol. Mass.:186899.26
Organism:Homo sapiens (Human)
Description:ChEMBL_1495738
Residue:1649
BDBM50072070
NameBDBM50072070
Synonyms:CHEMBL3407504
TypeSmall organic molecule
Emp. Form.C33H28N6O3
Mol. Mass.556.6138
SMILESCNc1ncc2ccc(Oc3c(C)ccc(C(=O)c4c(-c5ccccc5)n(C)n(-c5ccccc5)c4=O)c3N)cc2n1