Reaction Details
TargetEukaryotic translation initiation factor 2-alpha kinase 1
LigandBDBM50072073
Substrate/Competitorn/a
Meas. Tech.ChEMBL_1467744 (CHEMBL3412170)
IC50>10000±n/a nM
Citation Smith, ALAndrews, KLBeckmann, HBellon, SFBeltran, PJBooker, SChen, HChung, YAD'Angelo, NDDao, JDellamaggiore, KRJaeckel, PKendall, RLabitzke, KLong, AMMaterna-Reichelt, SMitchell, PNorman, MHPowers, DRose, MShaffer, PLWu, MMLipford, JR Discovery of 1H-pyrazol-3(2H)-ones as potent and selective inhibitors of protein kinase R-like endoplasmic reticulum kinase (PERK). J Med Chem58:1426-41 (2015) 
 
Eukaryotic translation initiation factor 2-alpha kinase 1
Name:Eukaryotic translation initiation factor 2-alpha kinase 1
Type:PROTEIN
Mol. Mass.:71098.55
Organism:Homo sapiens (Human)
Description:ChEMBL_1467744
Residue:630
BDBM50072073
NameBDBM50072073
Synonyms:CHEMBL3407848
TypeSmall organic molecule
Emp. Form.C33H27N5O5
Mol. Mass.573.598
SMILESCOc1cc2nccc(Oc3ccc(NC(=O)c4c(-c5ccccc5)n(C)n(-c5ccccc5)c4=O)nc3)c2cc1OC