Reaction Details
TargetSerine/threonine-protein kinase B-raf
LigandBDBM50072072
Substrate/Competitorn/a
Meas. Tech.ChEMBL_1467745 (CHEMBL3412171)
IC50 8.0±n/a nM
Citation Smith, ALAndrews, KLBeckmann, HBellon, SFBeltran, PJBooker, SChen, HChung, YAD'Angelo, NDDao, JDellamaggiore, KRJaeckel, PKendall, RLabitzke, KLong, AMMaterna-Reichelt, SMitchell, PNorman, MHPowers, DRose, MShaffer, PLWu, MMLipford, JR Discovery of 1H-pyrazol-3(2H)-ones as potent and selective inhibitors of protein kinase R-like endoplasmic reticulum kinase (PERK). J Med Chem58:1426-41 (2015) 
 
Serine/threonine-protein kinase B-raf
Name:Serine/threonine-protein kinase B-raf
Type:Serine/threonine-protein kinase
Mol. Mass.:84446.00
Organism:Homo sapiens (Human)
Description:P15056
Residue:766
BDBM50072072
NameBDBM50072072
Synonyms:CHEMBL3407849
TypeSmall organic molecule
Emp. Form.C33H27N5O3
Mol. Mass.541.5992
SMILESCNc1ncc2ccc(Oc3cc(ccc3C)C(=O)c3c(-c4ccccc4)n(C)n(-c4ccccc4)c3=O)cc2n1