Reaction Details
TargetEukaryotic translation initiation factor 2-alpha kinase 3
LigandBDBM50072030
Substrate/Competitorn/a
Meas. Tech.ChEMBL_1467746 (CHEMBL3412172)
IC50 20±n/a nM
Citation Smith, ALAndrews, KLBeckmann, HBellon, SFBeltran, PJBooker, SChen, HChung, YAD'Angelo, NDDao, JDellamaggiore, KRJaeckel, PKendall, RLabitzke, KLong, AMMaterna-Reichelt, SMitchell, PNorman, MHPowers, DRose, MShaffer, PLWu, MMLipford, JR Discovery of 1H-pyrazol-3(2H)-ones as potent and selective inhibitors of protein kinase R-like endoplasmic reticulum kinase (PERK). J Med Chem58:1426-41 (2015) 
 
Eukaryotic translation initiation factor 2-alpha kinase 3
Name:Eukaryotic translation initiation factor 2-alpha kinase 3
Type:Enzyme
Mol. Mass.:125190.66
Organism:Homo sapiens (Human)
Description:Q9NZJ5
Residue:1116
BDBM50072030
NameBDBM50072030
Synonyms:CHEMBL3407856
TypeSmall organic molecule
Emp. Form.C32H26N4O2S
Mol. Mass.530.639
SMILESCc1nc2ccc(cc2s1)-c1c(C)ccc(C(=O)c2c(-c3ccccc3)n(C)n(-c3ccccc3)c2=O)c1N