Reaction Details
TargetEukaryotic translation initiation factor 2-alpha kinase 3
LigandBDBM50072070
Substrate/Competitorn/a
Meas. Tech.ChEMBL_1467748 (CHEMBL3412174)
EC50 130±n/a nM
Citation Smith, ALAndrews, KLBeckmann, HBellon, SFBeltran, PJBooker, SChen, HChung, YAD'Angelo, NDDao, JDellamaggiore, KRJaeckel, PKendall, RLabitzke, KLong, AMMaterna-Reichelt, SMitchell, PNorman, MHPowers, DRose, MShaffer, PLWu, MMLipford, JR Discovery of 1H-pyrazol-3(2H)-ones as potent and selective inhibitors of protein kinase R-like endoplasmic reticulum kinase (PERK). J Med Chem58:1426-41 (2015) 
 
Eukaryotic translation initiation factor 2-alpha kinase 3
Name:Eukaryotic translation initiation factor 2-alpha kinase 3
Type:Enzyme
Mol. Mass.:125190.66
Organism:Homo sapiens (Human)
Description:Q9NZJ5
Residue:1116
BDBM50072070
NameBDBM50072070
Synonyms:CHEMBL3407504
TypeSmall organic molecule
Emp. Form.C33H28N6O3
Mol. Mass.556.6138
SMILESCNc1ncc2ccc(Oc3c(C)ccc(C(=O)c4c(-c5ccccc5)n(C)n(-c5ccccc5)c4=O)c3N)cc2n1