Reaction Details
TargetEukaryotic translation initiation factor 2-alpha kinase 3
LigandBDBM50072038
Substrate/Competitorn/a
Meas. Tech.ChEMBL_1467748 (CHEMBL3412174)
EC50 52±n/a nM
Citation Smith, ALAndrews, KLBeckmann, HBellon, SFBeltran, PJBooker, SChen, HChung, YAD'Angelo, NDDao, JDellamaggiore, KRJaeckel, PKendall, RLabitzke, KLong, AMMaterna-Reichelt, SMitchell, PNorman, MHPowers, DRose, MShaffer, PLWu, MMLipford, JR Discovery of 1H-pyrazol-3(2H)-ones as potent and selective inhibitors of protein kinase R-like endoplasmic reticulum kinase (PERK). J Med Chem58:1426-41 (2015) 
 
Eukaryotic translation initiation factor 2-alpha kinase 3
Name:Eukaryotic translation initiation factor 2-alpha kinase 3
Type:Enzyme
Mol. Mass.:125190.66
Organism:Homo sapiens (Human)
Description:Q9NZJ5
Residue:1116
BDBM50072038
NameBDBM50072038
Synonyms:CHEMBL3407863
TypeSmall organic molecule
Emp. Form.C25H21F4N5O
Mol. Mass.483.4608
SMILESCc1nc(N)c2c(cn(C)c2n1)-c1ccc2N(CC(=O)c3cc(F)cc(c3)C(F)(F)F)CCc2c1