Reaction Details
TargetKynurenine 3-monooxygenase
LigandBDBM50072081
Substrate/Competitorn/a
Meas. Tech.ChEMBL_1467951 (CHEMBL3413308)
IC50 82±n/a nM
Citation Toledo-Sherman, LMPrime, MEMrzljak, LBeconi, MGBeresford, ABrookfield, FABrown, CJCardaun, ICourtney, SMDijkman, UHamelin-Flegg, EJohnson, PDKempf, VLyons, KMatthews, KMitchell, WLO'Connell, CPena, PPowell, KRassoulpour, AReed, LReindl, WSelvaratnam, SFriley, WWWeddell, DAWent, NEWheelan, PWinkler, CWinkler, DWityak, JYarnold, CJYates, DMunoz-Sanjuan, IDominguez, C Development of a series of aryl pyrimidine kynurenine monooxygenase inhibitors as potential therapeutic agents for the treatment of Huntington's disease. J Med Chem58:1159-83 (2015) 
 
Kynurenine 3-monooxygenase
Name:Kynurenine 3-monooxygenase
Type:PROTEIN
Mol. Mass.:55831.03
Organism:Homo sapiens (Human)
Description:ChEMBL_1487479
Residue:486
BDBM50072081
NameBDBM50072081
Synonyms:CHEMBL3407922
TypeSmall organic molecule
Emp. Form.C14H11ClN2O3
Mol. Mass.290.702
SMILESOC(=O)c1cc(ncn1)-c1ccc(OC2CC2)c(Cl)c1