Reaction Details
TargetKynurenine 3-monooxygenase
LigandBDBM50072093
Substrate/Competitorn/a
Meas. Tech.ChEMBL_1467939 (CHEMBL3413143)
IC50 1100±n/a nM
Citation Toledo-Sherman, LMPrime, MEMrzljak, LBeconi, MGBeresford, ABrookfield, FABrown, CJCardaun, ICourtney, SMDijkman, UHamelin-Flegg, EJohnson, PDKempf, VLyons, KMatthews, KMitchell, WLO'Connell, CPena, PPowell, KRassoulpour, AReed, LReindl, WSelvaratnam, SFriley, WWWeddell, DAWent, NEWheelan, PWinkler, CWinkler, DWityak, JYarnold, CJYates, DMunoz-Sanjuan, IDominguez, C Development of a series of aryl pyrimidine kynurenine monooxygenase inhibitors as potential therapeutic agents for the treatment of Huntington's disease. J Med Chem58:1159-83 (2015) 
 
Kynurenine 3-monooxygenase
Name:Kynurenine 3-monooxygenase
Type:PROTEIN
Mol. Mass.:55831.03
Organism:Homo sapiens (Human)
Description:ChEMBL_1487479
Residue:486
BDBM50072093
NameBDBM50072093
Synonyms:CHEMBL3407875
TypeSmall organic molecule
Emp. Form.C12H7Cl2NO2
Mol. Mass.268.095
SMILESOC(=O)c1ccnc(c1)-c1ccc(Cl)c(Cl)c1