Reaction Details
TargetKynurenine 3-monooxygenase
LigandBDBM50072099
Substrate/Competitorn/a
Meas. Tech.ChEMBL_1467939 (CHEMBL3413143)
IC50 5500±n/a nM
Citation Toledo-Sherman, LMPrime, MEMrzljak, LBeconi, MGBeresford, ABrookfield, FABrown, CJCardaun, ICourtney, SMDijkman, UHamelin-Flegg, EJohnson, PDKempf, VLyons, KMatthews, KMitchell, WLO'Connell, CPena, PPowell, KRassoulpour, AReed, LReindl, WSelvaratnam, SFriley, WWWeddell, DAWent, NEWheelan, PWinkler, CWinkler, DWityak, JYarnold, CJYates, DMunoz-Sanjuan, IDominguez, C Development of a series of aryl pyrimidine kynurenine monooxygenase inhibitors as potential therapeutic agents for the treatment of Huntington's disease. J Med Chem58:1159-83 (2015) 
 
Kynurenine 3-monooxygenase
Name:Kynurenine 3-monooxygenase
Type:PROTEIN
Mol. Mass.:55831.03
Organism:Homo sapiens (Human)
Description:ChEMBL_1487479
Residue:486
BDBM50072099
NameBDBM50072099
Synonyms:CHEMBL3407881
TypeSmall organic molecule
Emp. Form.C11H7Cl2N3O2
Mol. Mass.284.098
SMILESNc1c(ncnc1-c1ccc(Cl)c(Cl)c1)C(O)=O