Reaction Details
TargetDelta-type opioid receptor
LigandBDBM50072324
Substrate/Competitorn/a
Meas. Tech.ChEMBL_1469044 (CHEMBL3413014)
Ki 18±n/a nM
Citation Iyer, MRRothman, RBDersch, CMJacobson, AERice, KC Probes for narcotic receptor mediated phenomena 49. N-substituted rac-cis-4a-arylalkyl-1,2,3,4,4a,9a-hexahydrobenzofuro[2,3-c]pyridin-6-ols. Eur J Med Chem92:531-9 (2015) 
 
Delta-type opioid receptor
Name:Delta-type opioid receptor
Type:G Protein-Coupled Receptor (GPCR)
Mol. Mass.:40382.98
Organism:Homo sapiens (Human)
Description:Competition binding assays were carried out using membrane preparations from transfected HN9.10 cells that constitutively expressed the delta opioid receptor.
Residue:372
BDBM50072324
NameBDBM50072324
Synonyms:CHEMBL3409104
TypeSmall organic molecule
Emp. Form.C29H30F3NO2
Mol. Mass.481.5492
SMILES[H][C@]12CN(CCc3ccc(cc3)C(F)(F)F)CC[C@@]1(CCCc1ccccc1)c1cc(O)ccc1O2