Reaction Details
TargetMu-type opioid receptor
LigandBDBM50072322
Substrate/Competitorn/a
Meas. Tech.ChEMBL_1469042 (CHEMBL3412858)
Ki 13±n/a nM
Citation Iyer, MRRothman, RBDersch, CMJacobson, AERice, KC Probes for narcotic receptor mediated phenomena 49. N-substituted rac-cis-4a-arylalkyl-1,2,3,4,4a,9a-hexahydrobenzofuro[2,3-c]pyridin-6-ols. Eur J Med Chem92:531-9 (2015) 
 
Mu-type opioid receptor
Name:Mu-type opioid receptor
Type:G Protein-Coupled Receptor (GPCR)
Mol. Mass.:44789.51
Organism:Homo sapiens (Human)
Description:P35372
Residue:400
BDBM50072322
NameBDBM50072322
Synonyms:CHEMBL3409106
TypeSmall organic molecule
Emp. Form.C24H29NO2
Mol. Mass.363.4926
SMILES[H][C@]12CN(CC3CC3)CC[C@@]1(CCCc1ccccc1)c1cc(O)ccc1O2