Reaction Details
TargetCannabinoid receptor 1
LigandBDBM50072349
Substrate/Competitorn/a
Meas. Tech.ChEMBL_1469197 (CHEMBL3413753)
Ki 4772±n/a nM
Citation Slavik, RHerde, AMBieri, DWeber, MSchibli, RKrämer, SDAmetamey, SMMu, L Synthesis, radiolabeling and evaluation of novel 4-oxo-quinoline derivatives as PET tracers for imaging cannabinoid type 2 receptor. Eur J Med Chem92:554-64 (2015) 
 
Cannabinoid receptor 1
Name:Cannabinoid receptor 1
Type:G Protein-Coupled Receptor (GPCR)
Mol. Mass.:52868.96
Organism:Homo sapiens (Human)
Description:P21554
Residue:472
BDBM50072349
NameBDBM50072349
Synonyms:CHEMBL3409322
TypeSmall organic molecule
Emp. Form.C23H24Cl2N2O3
Mol. Mass.447.354
SMILESCOc1ccc2n(C(=O)c3ccc(Cl)cc3Cl)c(C)c(CCN3CCOCC3)c2c1