Reaction Details
TargetCannabinoid receptor 2
LigandBDBM50072351
Substrate/Competitorn/a
Meas. Tech.ChEMBL_1469192 (CHEMBL3413748)
Ki 360±n/a nM
Citation Slavik, RHerde, AMBieri, DWeber, MSchibli, RKrämer, SDAmetamey, SMMu, L Synthesis, radiolabeling and evaluation of novel 4-oxo-quinoline derivatives as PET tracers for imaging cannabinoid type 2 receptor. Eur J Med Chem92:554-64 (2015) 
 
Cannabinoid receptor 2
Name:Cannabinoid receptor 2
Type:G Protein-Coupled Receptor (GPCR)
Mol. Mass.:39690.94
Organism:Homo sapiens (Human)
Description:P34972
Residue:360
BDBM50072351
NameBDBM50072351
Synonyms:CHEMBL3409319
TypeSmall organic molecule
Emp. Form.C23H26N2O4
Mol. Mass.394.4635
SMILESCCOCCn1cc(C(=O)NCCc2ccccc2)c(=O)c2cccc(OC)c12