Reaction Details
TargetReduced folate transporter
LigandBDBM50072399
Substrate/Competitorn/a
Meas. Tech.ChEMBL_1469594 (CHEMBL3412689)
IC50 60±n/a nM
Citation Wang, YMitchell-Ryan, SRaghavan, SGeorge, COrr, SHou, ZMatherly, LHGangjee, A Novel 5-substituted pyrrolo[2,3-d]pyrimidines as dual inhibitors of glycinamide ribonucleotide formyltransferase and 5-aminoimidazole-4-carboxamide ribonucleotide formyltransferase and as potential antitumor agents. J Med Chem58:1479-93 (2015) 
 
Reduced folate transporter
Name:Reduced folate transporter
Type:PROTEIN
Mol. Mass.:64885.16
Organism:Homo sapiens (Human)
Description:ChEMBL_1469594
Residue:591
BDBM50072399
NameBDBM50072399
Synonyms:CHEMBL3407519
TypeSmall organic molecule
Emp. Form.C18H19N5O6S
Mol. Mass.433.438
SMILESNc1nc2[nH]cc(CCc3ccc(s3)C(=O)N[C@@H](CCC(O)=O)C(O)=O)c2c(=O)[nH]1