Reaction Details
TargetProton-coupled folate transporter
LigandBDBM50306576
Substrate/Competitorn/a
Meas. Tech.ChEMBL_1469597 (CHEMBL3412692)
IC50 43±n/a nM
Citation Wang, YMitchell-Ryan, SRaghavan, SGeorge, COrr, SHou, ZMatherly, LHGangjee, A Novel 5-substituted pyrrolo[2,3-d]pyrimidines as dual inhibitors of glycinamide ribonucleotide formyltransferase and 5-aminoimidazole-4-carboxamide ribonucleotide formyltransferase and as potential antitumor agents. J Med Chem58:1479-93 (2015) 
 
Proton-coupled folate transporter
Name:Proton-coupled folate transporter
Type:PROTEIN
Mol. Mass.:49782.13
Organism:Homo sapiens (Human)
Description:ChEMBL_1469597
Residue:459
BDBM50306576
NameBDBM50306576
Synonyms:(S)-2-({5-[4-(2-Amino-4-oxo-4,7-dihydro-3H-pyrrolo[2,3-d]-pyrimidin-6-yl)-butyl]-thiophene-2-carbonyl}-amino)-pentanedioicAcid CHEMBL590740
TypeSmall organic molecule
Emp. Form.C20H23N5O6S
Mol. Mass.461.492
SMILESNc1nc2[nH]c(CCCCc3ccc(s3)C(=O)N[C@@H](CCC(O)=O)C(O)=O)cc2c(=O)[nH]1