Reaction Details
TargetCytochrome P450 3A4
LigandBDBM120086
Substrate/Competitorn/a
Meas. Tech.ChEMBL_1469854 (CHEMBL3413965)
IC50>10000±n/a nM
Citation Ren, LGrina, JMoreno, DBlake, JFGaudino, JJGarrey, RMetcalf, ATBurkard, MMartinson, MRasor, KChen, HDean, BGould, SEPacheco, PShahidi-Latham, SYin, JWest, KWang, WMoffat, JGSchwarz, JB Discovery of highly potent, selective, and efficacious small molecule inhibitors of ERK1/2. J Med Chem58:1976-91 (2015) 
 
Cytochrome P450 3A4
Name:Cytochrome P450 3A4
Type:Enzyme
Mol. Mass.:57349.57
Organism:Homo sapiens (Human)
Description:n/a
Residue:503
BDBM120086
NameBDBM120086
Synonyms:US8697715, 1 | US9259470, 1
TypeSmall organic molecule
Emp. Form.C22H22ClFN4O3
Mol. Mass.444.886
SMILESOC[C@H](c1ccc(Cl)c(F)c1)n1ccc(cc1=O)-c1ccnc(NC2CCOCC2)n1