Reaction Details
TargetMitogen-activated protein kinase 1
LigandBDBM50072606
Substrate/Competitorn/a
Meas. Tech.ChEMBL_1469629 (CHEMBL3412886)
Ki 0.100000±n/a nM
Citation Ren, LGrina, JMoreno, DBlake, JFGaudino, JJGarrey, RMetcalf, ATBurkard, MMartinson, MRasor, KChen, HDean, BGould, SEPacheco, PShahidi-Latham, SYin, JWest, KWang, WMoffat, JGSchwarz, JB Discovery of highly potent, selective, and efficacious small molecule inhibitors of ERK1/2. J Med Chem58:1976-91 (2015) 
 
Mitogen-activated protein kinase 1
Name:Mitogen-activated protein kinase 1
Type:Ser/Thr Protein Kinase
Mol. Mass.:41392.76
Organism:Homo sapiens (Human)
Description:P28482
Residue:360
BDBM50072606
NameBDBM50072606
Synonyms:CHEMBL3409578
TypeSmall organic molecule
Emp. Form.C23H26N4O4
Mol. Mass.422.4769
SMILESCOc1cccc(c1)C(CO)n1ccc(cc1=O)-c1ccnc(NC2CCOCC2)n1