Reaction Details
TargetMitogen-activated protein kinase 1
LigandBDBM50072614
Substrate/Competitorn/a
Meas. Tech.ChEMBL_1469629 (CHEMBL3412886)
Ki 1.8±n/a nM
Citation Ren, LGrina, JMoreno, DBlake, JFGaudino, JJGarrey, RMetcalf, ATBurkard, MMartinson, MRasor, KChen, HDean, BGould, SEPacheco, PShahidi-Latham, SYin, JWest, KWang, WMoffat, JGSchwarz, JB Discovery of highly potent, selective, and efficacious small molecule inhibitors of ERK1/2. J Med Chem58:1976-91 (2015) 
 
Mitogen-activated protein kinase 1
Name:Mitogen-activated protein kinase 1
Type:Ser/Thr Protein Kinase
Mol. Mass.:41392.76
Organism:Homo sapiens (Human)
Description:P28482
Residue:360
BDBM50072614
NameBDBM50072614
Synonyms:CHEMBL3409601
TypeSmall organic molecule
Emp. Form.C21H20ClFN4O3
Mol. Mass.430.86
SMILESOC[C@H](c1ccc(Cl)c(F)c1)n1ccc(cc1=O)-c1ccnc(N[C@@H]2CCOC2)n1