Reaction Details
TargetSolute carrier organic anion transporter family member 1B3
LigandBDBM50001839
Substrate/Competitorn/a
Meas. Tech.ChEMBL_1467097 (CHEMBL3411294)
IC50 260±n/a nM
Citation Marada, VVFlörl, SKühne, ABurckhardt, GHagos, Y Interaction of human organic anion transporter polypeptides 1B1 and 1B3 with antineoplastic compounds. Eur J Med Chem92:723-31 (2015) 
 
Solute carrier organic anion transporter family member 1B3
Name:Solute carrier organic anion transporter family member 1B3
Type:Protein
Mol. Mass.:77425.75
Organism:Homo sapiens (Human)
Description:Q9NPD5
Residue:702
BDBM50001839
NameBDBM50001839
Synonyms:CHEMBL428647 taxol
TypeSmall organic molecule
Emp. Form.C47H51NO14
Mol. Mass.853.9061
SMILESCC(=O)O[C@@H]1C2=C(C)[C@H](C[C@@](O)([C@@H](OC(=O)c3ccccc3)[C@@H]3[C@@]4(CO[C@@H]4C[C@H](O)[C@@]3(C)C1=O)OC(C)=O)C2(C)C)OC(=O)[C@H](O)[C@@H](NC(=O)c1ccccc1)c1ccccc1