Reaction Details
TargetLIM domain kinase 1
LigandBDBM50072664
Substrate/Competitorn/a
Meas. Tech.ChEMBL_1467118 (CHEMBL3411315)
IC50 470±n/a nM
Citation Yin, YZheng, KEid, NHoward, SJeong, JHYi, FGuo, JPark, CMBibian, MWu, WHernandez, PPark, HWu, YLuo, JLLoGrasso, PVFeng, Y Bis-aryl urea derivatives as potent and selective LIM kinase (Limk) inhibitors. J Med Chem58:1846-61 (2015) 
 
LIM domain kinase 1
Name:LIM domain kinase 1
Type:PROTEIN
Mol. Mass.:72598.76
Organism:Rattus norvegicus
Description:ChEMBL_109573
Residue:647
BDBM50072664
NameBDBM50072664
Synonyms:CHEMBL3410036
TypeSmall organic molecule
Emp. Form.C22H21N5O2
Mol. Mass.387.4344
SMILESCc1c[nH]c2ncnc(-c3ccc(NC(=O)N(CCO)c4ccccc4)cc3)c12