Reaction Details
TargetLIM domain kinase 1
LigandBDBM50072665
Substrate/Competitorn/a
Meas. Tech.ChEMBL_1467118 (CHEMBL3411315)
IC50 420±n/a nM
Citation Yin, YZheng, KEid, NHoward, SJeong, JHYi, FGuo, JPark, CMBibian, MWu, WHernandez, PPark, HWu, YLuo, JLLoGrasso, PVFeng, Y Bis-aryl urea derivatives as potent and selective LIM kinase (Limk) inhibitors. J Med Chem58:1846-61 (2015) 
 
LIM domain kinase 1
Name:LIM domain kinase 1
Type:PROTEIN
Mol. Mass.:72598.76
Organism:Rattus norvegicus
Description:ChEMBL_109573
Residue:647
BDBM50072665
NameBDBM50072665
Synonyms:CHEMBL3410040
TypeSmall organic molecule
Emp. Form.C22H20ClN5O2
Mol. Mass.421.88
SMILESCc1c[nH]c2ncnc(-c3ccc(NC(=O)N(CCO)c4ccccc4Cl)cc3)c12