Reaction Details
TargetRho-associated protein kinase 2
LigandBDBM50072680
Substrate/Competitorn/a
Meas. Tech.ChEMBL_1467102 (CHEMBL3411299)
IC50 5421±n/a nM
Citation Yin, YZheng, KEid, NHoward, SJeong, JHYi, FGuo, JPark, CMBibian, MWu, WHernandez, PPark, HWu, YLuo, JLLoGrasso, PVFeng, Y Bis-aryl urea derivatives as potent and selective LIM kinase (Limk) inhibitors. J Med Chem58:1846-61 (2015) 
 
Rho-associated protein kinase 2
Name:Rho-associated protein kinase 2
Type:Protein
Mol. Mass.:160885.43
Organism:Homo sapiens (Human)
Description:O75116
Residue:1388
BDBM50072680
NameBDBM50072680
Synonyms:CHEMBL3410029
TypeSmall organic molecule
Emp. Form.C20H16FN5O
Mol. Mass.361.3723
SMILESCc1c[nH]c2ncnc(-c3ccc(NC(=O)Nc4cccc(F)c4)cc3)c12