Reaction Details
TargetRho-associated protein kinase 2
LigandBDBM50072723
Substrate/Competitorn/a
Meas. Tech.ChEMBL_1467102 (CHEMBL3411299)
IC50>10000±n/a nM
Citation Yin, YZheng, KEid, NHoward, SJeong, JHYi, FGuo, JPark, CMBibian, MWu, WHernandez, PPark, HWu, YLuo, JLLoGrasso, PVFeng, Y Bis-aryl urea derivatives as potent and selective LIM kinase (Limk) inhibitors. J Med Chem58:1846-61 (2015) 
 
Rho-associated protein kinase 2
Name:Rho-associated protein kinase 2
Type:Protein
Mol. Mass.:160885.43
Organism:Homo sapiens (Human)
Description:O75116
Residue:1388
BDBM50072723
NameBDBM50072723
Synonyms:CHEMBL3410032
TypeSmall organic molecule
Emp. Form.C21H19N5O2
Mol. Mass.373.4079
SMILESCOc1ccc(NC(=O)Nc2ccc(cc2)-c2ncnc3[nH]cc(C)c23)cc1