Reaction Details
TargetLIM domain kinase 1
LigandBDBM50072671
Substrate/Competitorn/a
Meas. Tech.ChEMBL_1467101 (CHEMBL3411298)
IC50 19±n/a nM
Citation Yin, YZheng, KEid, NHoward, SJeong, JHYi, FGuo, JPark, CMBibian, MWu, WHernandez, PPark, HWu, YLuo, JLLoGrasso, PVFeng, Y Bis-aryl urea derivatives as potent and selective LIM kinase (Limk) inhibitors. J Med Chem58:1846-61 (2015) 
 
LIM domain kinase 1
Name:LIM domain kinase 1
Type:Enzyme Catalytic Domain
Mol. Mass.:72591.81
Organism:Homo sapiens (Human)
Description:gi_4505001
Residue:647
BDBM50072671
NameBDBM50072671
Synonyms:CHEMBL3410055
TypeSmall organic molecule
Emp. Form.C25H26ClFN6O
Mol. Mass.480.965
SMILESCN(C)CCN(C(=O)Nc1ccc(cc1F)-c1ncnc2[nH]c(C)c(C)c12)c1ccc(Cl)cc1