Reaction Details
TargetLIM domain kinase 1
LigandBDBM50072677
Substrate/Competitorn/a
Meas. Tech.ChEMBL_1467101 (CHEMBL3411298)
IC50>10000±n/a nM
Citation Yin, YZheng, KEid, NHoward, SJeong, JHYi, FGuo, JPark, CMBibian, MWu, WHernandez, PPark, HWu, YLuo, JLLoGrasso, PVFeng, Y Bis-aryl urea derivatives as potent and selective LIM kinase (Limk) inhibitors. J Med Chem58:1846-61 (2015) 
 
LIM domain kinase 1
Name:LIM domain kinase 1
Type:Enzyme Catalytic Domain
Mol. Mass.:72591.81
Organism:Homo sapiens (Human)
Description:gi_4505001
Residue:647
BDBM50072677
NameBDBM50072677
Synonyms:CHEMBL1951349
TypeSmall organic molecule
Emp. Form.C24H23N5O2
Mol. Mass.413.4717
SMILESCC(C)NC(=O)c1cccc(NC(=O)Nc2ccc(cc2)-c2ccnc3[nH]ccc23)c1