Reaction Details
TargetLIM domain kinase 1
LigandBDBM50072675
Substrate/Competitorn/a
Meas. Tech.ChEMBL_1467101 (CHEMBL3411298)
IC50>10000±n/a nM
Citation Yin, YZheng, KEid, NHoward, SJeong, JHYi, FGuo, JPark, CMBibian, MWu, WHernandez, PPark, HWu, YLuo, JLLoGrasso, PVFeng, Y Bis-aryl urea derivatives as potent and selective LIM kinase (Limk) inhibitors. J Med Chem58:1846-61 (2015) 
 
LIM domain kinase 1
Name:LIM domain kinase 1
Type:Enzyme Catalytic Domain
Mol. Mass.:72591.81
Organism:Homo sapiens (Human)
Description:gi_4505001
Residue:647
BDBM50072675
NameBDBM50072675
Synonyms:CHEMBL3410022
TypeSmall organic molecule
Emp. Form.C20H21N5O2
Mol. Mass.363.413
SMILESCC(C)NC(=O)c1cccc(NC(=O)Nc2ccc(cc2)-c2cn[nH]c2)c1